BDBM50352521 CHEMBL1824858
SMILES Cc1cc(N)nc(C[C@@H]2CNC[C@@H]2OCCNCC(F)(F)c2cc(F)cc(Cl)c2)c1
InChI Key InChIKey=WCMZHGFWPJYQKM-KUHUBIRLSA-N
Data  3 KI
PDB links: 1 PDB ID matches this monomer.
  Tab Delimited (TSV)   2D SDfile   Computed 3D by Vconf -m prep SDfile
Find this compound or compounds like it in BindingDB:
Activity Spreadsheet -- Enzyme Inhibition Constant Data from BindingDB
Found 3 hits for monomerid = 50352521
TargetNitric oxide synthase, brain(Rattus norvegicus (rat))
Northwestern University
Curated by ChEMBL
LigandPNGBDBM50352521(CHEMBL1824858)
Affinity DataKi:  77nM. Assay description: Inhibition of rat nNOS expressed in Escherichia coli assessed as reduction in formation of nitric oxide by hemoglobin capture assay
TargetNitric oxide synthase, endothelial(Bos taurus (bovine))
Northwestern University
Curated by ChEMBL
LigandPNGBDBM50352521(CHEMBL1824858)
Affinity DataKi:  1.70E+4nM. Assay description: Inhibition of bovine eNOS expressed in Escherichia coli assessed as reduction in formation of nitric oxide by hemoglobin capture assay
In DepthDetails ArticlePubMed
TargetNitric oxide synthase, inducible(Mus musculus (mouse))
Northwestern University
Curated by ChEMBL
LigandPNGBDBM50352521(CHEMBL1824858)
Affinity DataKi:  1.70E+4nM. Assay description: Inhibition of mouse iNOS expressed in Escherichia coli assessed as reduction in formation of nitric oxide by hemoglobin capture assay
In DepthDetails ArticlePubMed