BDBM50354676 CHEMBL1834262
SMILES FC(F)(F)c1ccccc1OC1CCN(CC1)c1nc2nc[nH]c(=O)c2s1
InChI Key InChIKey=VCVPLZYCGTZQPH-UHFFFAOYSA-N
Data  2 IC50
  Tab Delimited (TSV)   2D SDfile   Computed 3D by Vconf -m prep SDfile
Find this compound or compounds like it in BindingDB:
Activity Spreadsheet -- Enzyme Inhibition Constant Data from BindingDB
Found 2 hits for monomerid = 50354676
TargetStearoyl-CoA desaturase(Homo sapiens (Human))
Merck Frosst Centre For Therapeutic Research
Curated by ChEMBL
LigandPNGBDBM50354676(CHEMBL1834262)
Affinity DataIC50:  29nM. Assay description: Inhibition of SCD1 in human HepG2 cells
In DepthDetails ArticlePubMed
TargetAcyl-CoA desaturase 1(Rattus norvegicus (Rat))
Merck Frosst Centre For Therapeutic Research
Curated by ChEMBL
LigandPNGBDBM50354676(CHEMBL1834262)
Affinity DataIC50:  7nM. Assay description: Inhibition of rat SCD1 in rat liver microsome
In DepthDetails ArticlePubMed