BDBM50358134 CHEMBL1923957
SMILES CC(C)[C@H](NS(=O)(=O)c1ccc(F)cc1)C(=O)N[C@@H](Cc1c[nH]c2ccccc12)C=O
InChI Key InChIKey=JWYNJSOQVDLZNK-UWJYYQICSA-N
Data  1 IC50
  Tab Delimited (TSV)   2D SDfile   Computed 3D by Vconf -m prep SDfile
Find this compound or compounds like it in BindingDB:
Activity Spreadsheet -- Enzyme Inhibition Constant Data from BindingDB
Found 1 hit for monomerid = 50358134
TargetCalpain-1 catalytic subunit(Rattus norvegicus)
University Of Canterbury
Curated by ChEMBL
LigandPNGBDBM50358134(CHEMBL1923957)
Affinity DataIC50:  23nM. Assay description: Inhibition of rat CAPN1 using BODIPY-labeled casein substrate by fluorometric analysis
In DepthDetails ArticlePubMed