BDBM50358136 CHEMBL1923959
SMILES CC(C)C[C@H](NC(=O)[C@@H](NS(=O)(=O)c1ccc(Cl)cc1)C(C)C)C=O
InChI Key InChIKey=ZQYXGYRPZWELDJ-HOCLYGCPSA-N
Data  1 IC50
  Tab Delimited (TSV)   2D SDfile   Computed 3D by Vconf -m prep SDfile
Find this compound or compounds like it in BindingDB:
Activity Spreadsheet -- Enzyme Inhibition Constant Data from BindingDB
Found 1 hit for monomerid = 50358136
TargetCalpain-1 catalytic subunit(Rattus norvegicus)
University Of Canterbury
Curated by ChEMBL
LigandPNGBDBM50358136(CHEMBL1923959)
Affinity DataIC50:  31nM. Assay description: Inhibition of rat CAPN1 using BODIPY-labeled casein substrate by fluorometric analysis
In DepthDetails ArticlePubMed