BDBM50358999 CHEMBL1923892
SMILES CC(C)N1CCc2nc(sc2C1)C(=O)Nc1cc(cc(Cl)c1CCC(=O)Nc1ccc(Cl)cc1)C(O)=O
InChI Key InChIKey=ZSWWTEQGMPHIOX-UHFFFAOYSA-N
Data  1 IC50
  Tab Delimited (TSV)   2D SDfile   Computed 3D by Vconf -m prep SDfile
Find this compound or compounds like it in BindingDB:
Activity Spreadsheet -- Enzyme Inhibition Constant Data from BindingDB
Found 1 hit for monomerid = 50358999
TargetCoagulation factor X(Homo sapiens (Human))
Daiichi Sankyo
Curated by ChEMBL
LigandPNGBDBM50358999(CHEMBL1923892)
Affinity DataIC50:  0.380nM. Assay description: Inhibition of human factor 10a using S-2222 as substrate by spectrophotometry
In DepthDetails ArticlePubMed