BDBM50359980 CHEMBL1927600
SMILES CCCCCCCCc1ccc(CC[C@](N)(CO)OC)cc1
InChI Key InChIKey=WTIARAGRFLNSKC-LJQANCHMSA-N
Data  2 KI
  Tab Delimited (TSV)   2D SDfile   Computed 3D by Vconf -m prep SDfile
Find this compound or compounds like it in BindingDB:
Activity Spreadsheet -- Enzyme Inhibition Constant Data from BindingDB
Found 2 hits for monomerid = 50359980
TargetSphingosine kinase 2(Homo sapiens (Human))
Heriot-Watt University
Curated by ChEMBL
LigandPNGBDBM50359980(CHEMBL1927600)
Affinity DataKi:  1.60E+4nM. Assay description: Inhibition of purified SK2 (unknown origin) using Sph as substrate measured after 15 to 20 mins in presence of [gamma32P]ATP by Cerenkov counting ana...
In DepthDetails ArticlePubMed
TargetSphingosine kinase 2(Homo sapiens (Human))
Heriot-Watt University
Curated by ChEMBL
LigandPNGBDBM50359980(CHEMBL1927600)
Affinity DataKi:  1.65E+4nM. Assay description: Inhibition of SphK2
In DepthDetails ArticlePubMed