BDBM50360183 CHEMBL1926693
SMILES Nc1nc(NCC[NH3+])nc2nc(nn12)-c1ccco1
InChI Key InChIKey=TUHMQVOAPJOLNG-UHFFFAOYSA-O
Data  1 KI  1 IC50
  Tab Delimited (TSV)   2D SDfile   Computed 3D by Vconf -m prep SDfile
Find this compound or compounds like it in BindingDB:
Activity Spreadsheet -- Enzyme Inhibition Constant Data from BindingDB
Found 2 hits for monomerid = 50360183
TargetAdenosine receptor A2a(Homo sapiens (Human))
Universita Di Trieste
Curated by ChEMBL
LigandPNGBDBM50360183(CHEMBL1926693)
Affinity DataKi:  567nM. Assay description: Displacement of [3H]ZM241385 from human adenosine A2A receptor expressed in HEK293 cells by scintillation counting
In DepthDetails ArticlePubMed
TargetAdenosine receptor A2b(Homo sapiens (Human))
Universita Di Trieste
Curated by ChEMBL
LigandPNGBDBM50360183(CHEMBL1926693)
Affinity DataIC50: >1.00E+5nM. Assay description: Antagonist activity at human recombinant adenosine A2B receptor expressed in CHO cells assessed as inhibition of NECA-stimulated adenylyl cyclase act...
In DepthDetails ArticlePubMed