BDBM50360419 CHEMBL1934253
SMILES Cc1nn(-c2ccc(cc2)C(=O)N[C@H]2CCCc3cc(CN4CCCCC4)ccc23)c(=O)c2ccccc12
InChI Key InChIKey=NOMAJLSWAKZQQU-PMERELPUSA-N
Data  1 KI  2 IC50
  Tab Delimited (TSV)   2D SDfile   Computed 3D by Vconf -m prep SDfile
Find this compound or compounds like it in BindingDB:
Activity Spreadsheet -- Enzyme Inhibition Constant Data from BindingDB
Found 3 hits for monomerid = 50360419
TargetB1 bradykinin receptor(Homo sapiens (Human))
Amgen
Curated by ChEMBL
LigandPNGBDBM50360419(CHEMBL1934253)
Affinity DataKi:  43nM. Assay description: Binding affinity to human B1 bradykinin receptor
In DepthDetails ArticlePubMed
TargetB1 bradykinin receptor(Oryctolagus cuniculus)
Amgen
Curated by ChEMBL
LigandPNGBDBM50360419(CHEMBL1934253)
Affinity DataIC50:  98nM. Assay description: Antagonist activity at rabbit B1 bradykinin receptor expressed in CHO cells
In DepthDetails ArticlePubMed
TargetB1 bradykinin receptor(Homo sapiens (Human))
Amgen
Curated by ChEMBL
LigandPNGBDBM50360419(CHEMBL1934253)
Affinity DataIC50:  7nM. Assay description: Antagonist activity at human B1 bradykinin receptor expressed in CHO cells by aqueorin-based calcium flux assay
In DepthDetails ArticlePubMed