BDBM50362220 CHEMBL1939379
SMILES Cc1cc(C)c2cc1-c1cc(SCCC(=O)NCCCNC2=O)nc(N)n1
InChI Key InChIKey=OMFBVBRFVYLRQT-UHFFFAOYSA-N
Data  1 Kd
PDB links: 1 PDB ID matches this monomer.
  Tab Delimited (TSV)   2D SDfile   Computed 3D by Vconf -m prep SDfile
Find this compound or compounds like it in BindingDB:
Activity Spreadsheet -- Enzyme Inhibition Constant Data from BindingDB
Found 1 hit for monomerid = 50362220
TargetHeat shock protein HSP 90-alpha(Homo sapiens (Human))
Chugai Pharmaceutical
Curated by ChEMBL
LigandPNGBDBM50362220(CHEMBL1939379)
Affinity DataKd:  0.520nM. Assay description: Binding affinity to N-terminus biotinylated human Hsp90 alpha by surface plasmon resonance assay