BDBM50362224 CHEMBL1939382
SMILES Cc1cc(C)c2cc1-c1cc(SCCCC(=O)NCCNC2=O)nc(N)n1
InChI Key InChIKey=RWFCWVOENLNUSF-UHFFFAOYSA-N
Data  1 Kd
  Tab Delimited (TSV)   2D SDfile   Computed 3D by Vconf -m prep SDfile
Find this compound or compounds like it in BindingDB:
Activity Spreadsheet -- Enzyme Inhibition Constant Data from BindingDB
Found 1 hit for monomerid = 50362224
TargetHeat shock protein HSP 90-alpha(Homo sapiens (Human))
Chugai Pharmaceutical
Curated by ChEMBL
LigandPNGBDBM50362224(CHEMBL1939382)
Affinity DataKd:  0.610nM. Assay description: Binding affinity to N-terminus biotinylated human Hsp90 alpha by surface plasmon resonance assay
In DepthDetails ArticlePubMed