BDBM50363156 CHEMBL1946998
SMILES OC(=O)c1ccc(\C=C\C(=O)c2ccc3ccccc3c2)cc1
InChI Key InChIKey=OCHBFKMZYRIYDH-KPKJPENVSA-N
Data  1 KI  3 IC50
  Tab Delimited (TSV)   2D SDfile   Computed 3D by Vconf -m prep SDfile
Find this compound or compounds like it in BindingDB:
Activity Spreadsheet -- Enzyme Inhibition Constant Data from BindingDB
Found 4 hits for monomerid = 50363156
TargetTYR_PHOSPHATASE_2 domain-containing protein(Mycobacterium tuberculosis)
Universidade Federal De Santa Catarina
Curated by ChEMBL
LigandPNGBDBM50363156(CHEMBL1946998)
Affinity DataKi:  8.00E+3nM. Assay description: Competitive inhibition of Mycobacterium tuberculosis PTP-B using p-nitrophenyl phosphate as substrate measured for 10 mins by Lineweaver-Burk plot an...
In DepthDetails ArticlePubMed
TargetTyrosine-protein phosphatase non-receptor type 1(Homo sapiens (Human))
Universidade Federal De Santa Catarina
Curated by ChEMBL
LigandPNGBDBM50363156(CHEMBL1946998)
Affinity DataIC50:  3.09E+6nM. Assay description: Inhibition of human PTP1B expressed in Escherichia coli BL21 DE3 using p-nitrophenyl phosphate as substrate measured for 10 mins by spectrofluorimetr...
In DepthDetails ArticlePubMed
TargetLow molecular weight protein-tyrosine phosphatase A(Mycobacterium tuberculosis)
Universidade Federal De Santa Catarina
Curated by ChEMBL
LigandPNGBDBM50363156(CHEMBL1946998)
Affinity DataIC50: >1.00E+5nM. Assay description: Inhibition of Mycobacterium tuberculosis PTP-A using p-nitrophenyl phosphate as substrate measured for 10 mins by spectrofluorimetry
In DepthDetails ArticlePubMed
TargetTYR_PHOSPHATASE_2 domain-containing protein(Mycobacterium tuberculosis)
Universidade Federal De Santa Catarina
Curated by ChEMBL
LigandPNGBDBM50363156(CHEMBL1946998)
Affinity DataIC50:  1.20E+4nM. Assay description: Inhibition of Mycobacterium tuberculosis PTP-B using p-nitrophenyl phosphate as substrate measured for 10 mins by spectrofluorimetry
In DepthDetails ArticlePubMed