BDBM50364800 CHEMBL1952146
SMILES Fc1ccc(cc1)-c1nnc2ccc(nn12)N1CCCCCC1
InChI Key InChIKey=DWBLZKBURAURMI-UHFFFAOYSA-N
Data  1 IC50
  Tab Delimited (TSV)   2D SDfile   Computed 3D by Vconf -m prep SDfile
Find this compound or compounds like it in BindingDB:
Activity Spreadsheet -- Enzyme Inhibition Constant Data from BindingDB
Found 1 hit for monomerid = 50364800
TargetSerine/threonine-protein kinase pim-1(Homo sapiens (Human))
Spanish National Cancer Research Centre (Cnio)
Curated by ChEMBL
LigandPNGBDBM50364800(CHEMBL1952146)
Affinity DataIC50:  96nM. Assay description: Inhibition of PIM1
In DepthDetails ArticlePubMed