BDBM50364825 CHEMBL1952128
SMILES FC(F)(F)Oc1cccc(c1)-n1nnc2ccc(nc12)N1CC2CNCC2C1
InChI Key InChIKey=ZOSLTFMNLPTPHD-UHFFFAOYSA-N
Data  1 IC50
  Tab Delimited (TSV)   2D SDfile   Computed 3D by Vconf -m prep SDfile
Find this compound or compounds like it in BindingDB:
Activity Spreadsheet -- Enzyme Inhibition Constant Data from BindingDB
Found 1 hit for monomerid = 50364825
TargetSerine/threonine-protein kinase pim-1(Homo sapiens (Human))
Spanish National Cancer Research Centre (Cnio)
Curated by ChEMBL
LigandPNGBDBM50364825(CHEMBL1952128)
Affinity DataIC50:  126nM. Assay description: Inhibition of PIM1
In DepthDetails ArticlePubMed