BDBM50366014 CHEMBL1956415
SMILES COc1ccccc1-c1cc(cc(C(C)C)c1CO)C(C)(C)C
InChI Key InChIKey=OTDBVKIKXYCVDI-UHFFFAOYSA-N
Data  1 IC50
  Tab Delimited (TSV)   2D SDfile   Computed 3D by Vconf -m prep SDfile
Find this compound or compounds like it in BindingDB:
Activity Spreadsheet -- Enzyme Inhibition Constant Data from BindingDB
Found 1 hit for monomerid = 50366014
TargetVasoactive intestinal polypeptide receptor 1(Rattus norvegicus)
Bristol-Myers Squibb
Curated by ChEMBL
LigandPNGBDBM50366014(CHEMBL1956415)
Affinity DataIC50:  820nM. Assay description: Antagonist activity at vasoactive intestinal peptide receptor 1 in rat RKE cells assessed as inhibition of VIP-induced intracellular cAMP accumulatio...
In DepthDetails ArticlePubMed