BDBM50366721 CHEMBL4171109
SMILES COc1cc2c(cc1-c1c(C)noc1C)[nH]c1nc(C)nc(Nc3cc(C)nn3C(C)(C)C)c21
InChI Key InChIKey=FVJNAHXPZSZFPS-UHFFFAOYSA-N
Data  1 KI  1 IC50
  Tab Delimited (TSV)   2D SDfile   Computed 3D by Vconf -m prep SDfile
Find this compound or compounds like it in BindingDB:
Activity Spreadsheet -- Enzyme Inhibition Constant Data from BindingDB
Found 2 hits for monomerid = 50366721
TargetBromodomain-containing protein 4(Homo sapiens (Human))
TBA
Curated by ChEMBL
LigandPNGBDBM50366721(CHEMBL4171109)
Affinity DataKi: <1nM. Assay description: Inhibition of FAM-labeled ZBA248 binding to recombinant human BRD4 bromodomain 1 (44 to 168 residues) expressed in Rosetta2 Escherichia coli DE3 cell...
In DepthDetails ArticlePubMed
TargetBromodomain-containing protein 4(Homo sapiens (Human))
TBA
Curated by ChEMBL
LigandPNGBDBM50366721(CHEMBL4171109)
Affinity DataIC50:  4.40nM. Assay description: Inhibition of FAM-labeled ZBA248 binding to recombinant human BRD4 bromodomain 1 (44 to 168 residues) expressed in Rosetta2 Escherichia coli DE3 cell...
In DepthDetails ArticlePubMed