BDBM50366748 CHEMBL4172447
SMILES COc1cc2c(cc1-c1c(C)noc1C)[nH]c1nc(C)nc(Nc3c4CCCc4nn3C)c21
InChI Key InChIKey=UTUWSIJTBRMJLU-UHFFFAOYSA-N
Data  1 KI  1 IC50
  Tab Delimited (TSV)   2D SDfile   Computed 3D by Vconf -m prep SDfile
Find this compound or compounds like it in BindingDB:
Activity Spreadsheet -- Enzyme Inhibition Constant Data from BindingDB
Found 2 hits for monomerid = 50366748
TargetBromodomain-containing protein 4(Homo sapiens (Human))
TBA
Curated by ChEMBL
LigandPNGBDBM50366748(CHEMBL4172447)
Affinity DataKi: <1nM. Assay description: Inhibition of FAM-labeled ZBA248 binding to recombinant human BRD4 bromodomain 1 (44 to 168 residues) expressed in Rosetta2 Escherichia coli DE3 cell...
In DepthDetails ArticlePubMed
TargetBromodomain-containing protein 4(Homo sapiens (Human))
TBA
Curated by ChEMBL
LigandPNGBDBM50366748(CHEMBL4172447)
Affinity DataIC50:  5.5nM. Assay description: Inhibition of FAM-labeled ZBA248 binding to recombinant human BRD4 bromodomain 1 (44 to 168 residues) expressed in Rosetta2 Escherichia coli DE3 cell...
In DepthDetails ArticlePubMed