BDBM50368504 CHEMBL1788126
SMILES CCCCCCCCCCCCCCCC(=O)Oc1cc(cc2cc(cc(OC(=O)CCCCCCCCCCCCCCC)c12)S([O-])(=O)=O)S([O-])(=O)=O
InChI Key InChIKey=OVEODBLYOULXQR-UHFFFAOYSA-L
Data  2 IC50
  Tab Delimited (TSV)   2D SDfile   Computed 3D by Vconf -m prep SDfile
Find this compound or compounds like it in BindingDB:
Activity Spreadsheet -- Enzyme Inhibition Constant Data from BindingDB
Found 2 hits for monomerid = 50368504
TargetReverse transcriptase/RNaseH(Human immunodeficiency virus 1)
University Of Illinois At Chicago
Curated by ChEMBL
LigandPNGBDBM50368504(CHEMBL1788126)
Affinity DataIC50:  860nM. Assay description: Inhibition of purified HIV-2 reverse transcriptase
In DepthDetails ArticlePubMed
TargetReverse transcriptase/RNaseH(Human immunodeficiency virus 1)
University Of Illinois At Chicago
Curated by ChEMBL
LigandPNGBDBM50368504(CHEMBL1788126)
Affinity DataIC50:  860nM. Assay description: Inhibition of purified HIV-2 reverse transcriptase
In DepthDetails ArticlePubMed