BDBM50369048 CHEMBL1203216
SMILES CN(C)S(=O)(=O)Nc1ccc(cc1)N1CCN(CC1)C(=O)COc1ccc2[nH]cc(CCN)c2c1
InChI Key InChIKey=SDKDZOOCFHSGBM-UHFFFAOYSA-N
Data  3 KI
  Tab Delimited (TSV)   2D SDfile   Computed 3D by Vconf -m prep SDfile
Find this compound or compounds like it in BindingDB:
Activity Spreadsheet -- Enzyme Inhibition Constant Data from BindingDB
Found 3 hits for monomerid = 50369048
Target5-hydroxytryptamine receptor 1D(Homo sapiens (Human))
Centre De Recherche Pierre Fabre
Curated by ChEMBL
LigandPNGBDBM50369048(CHEMBL1203216)
Affinity DataKi:  0.260nM. Assay description: Binding affinity to recombinant human 5-hydroxytryptamine 1D receptor alpha
In DepthDetails ArticlePubMed
Target5-hydroxytryptamine receptor 1D(Homo sapiens (Human))
Centre De Recherche Pierre Fabre
Curated by ChEMBL
LigandPNGBDBM50369048(CHEMBL1203216)
Affinity DataKi:  1.90nM. Assay description: Binding affinity for cloned human 5-hydroxytryptamine 1D receptor beta
In DepthDetails ArticlePubMed
Target5-hydroxytryptamine receptor 1A(Homo sapiens (Human))
Centre De Recherche Pierre Fabre
Curated by ChEMBL
LigandPNGBDBM50369048(CHEMBL1203216)
Affinity DataKi:  40nM. Assay description: Binding affinity for cloned human 5-hydroxytryptamine 1A receptor
In DepthDetails ArticlePubMed