BDBM50369190 CHEMBL4163133
SMILES C[C@H](NC(=O)OCc1ccccc1)C(=O)NCC(=O)N[C@@H](CCC(O)=O)C(=O)N[C@@H](C)C(=O)N[C@@H](CC1CCCC1)C(=O)N[C@@H](Cc1ccc(O)cc1)C(=O)N[C@@H](CCC(O)=O)C(N)=O
InChI Key InChIKey=NHZYGJYQIJWYMS-WBVMMGACSA-N
Data  1 KI  1 Kd
  Tab Delimited (TSV)   2D SDfile   Computed 3D by Vconf -m prep SDfile
Find this compound or compounds like it in BindingDB:
Activity Spreadsheet -- Enzyme Inhibition Constant Data from BindingDB
Found 2 hits for monomerid = 50369190
TargetAdenomatous polyposis coli protein(Homo sapiens (Human))TBA
LigandPNGBDBM50369190(CHEMBL4163133)
Affinity DataKi:  15nM. Assay description: Binding affinity to APC (unknown origin) assessed as inhibition constant by ITC analysis
In DepthDetails PubMed
TargetAdenomatous polyposis coli protein(Homo sapiens (Human))TBA
LigandPNGBDBM50369190(CHEMBL4163133)
Affinity DataKd:  570nM. Assay description: Binding affinity to APC protein (303 to 739 residues) (unknown origin) incubated for 60 mins followed by probe addition and measured after 60 mins by...
In DepthDetails ArticlePubMed