BDBM50369801 CHEMBL1790241
SMILES CC[C@H](C)[C@H](NC(=O)[C@H](CC(O)=O)NC(=O)[C@H](CC(C)C)NC(=O)[C@H](CC(C)C)NC(=O)[C@H](CCCCN)NC(=O)[C@H](CCCN=C(N)N)NC(=O)[C@H](CC(N)=O)NC(=O)[C@H](CO)NC(=O)[C@H](Cc1c[nH]cn1)NC(=O)[C@H](C)NC(=O)[C@H](CCC(N)=O)NC(=O)[C@H](CCC(N)=O)NC(=O)[C@H](C)NC(=O)[C@H](CC(C)C)NC(=O)[C@H](CCC(N)=O)NC(=O)[C@H](CC(O)=O)NC(=O)[C@@H](C)NC(=O)[C@H](CCCCN)NC(=O)[C@H](NC(=O)[C@H](CCSC)NC(=O)[C@H](CCC(O)=O)NC(=O)[C@H](CC(C)C)NC(=O)[C@@H](NC(=O)[C@H](CCC(O)=O)NC(=O)[C@H](CCCN=C(N)N)NC(=O)[C@H](CC(C)C)NC(=O)[C@H](CC(C)C)NC(=O)[C@H](Cc1c[nH]cn1)NC(=O)[C@H](Cc1ccccc1)NC(=O)[C@@H](NC(=O)[C@H](CC(C)C)NC(=O)[C@H](CC(O)=O)NC(=O)[C@H](CC(C)C)NC(=O)[C@H](CO)NC(=O)[C@@H](NC(=O)[C@@H]1CCCN1C(=O)[C@H]1CCCN1C(=O)[C@@H](CCC(O)=O)NC(=O)[C@H](CCC(N)=O)NC(=O)[C@@H](N)CO)[C@@H](C)CC)C(C)O)C(C)C)[C@@H](C)O)C(=O)N[C@@H](C)C(N)=O
InChI Key InChIKey=QEEJLLNYQOBRRM-LEUAJAPISA-N
Data  2 KI  2 EC50
  Tab Delimited (TSV)   2D SDfile   Computed 3D by Vconf -m prep SDfile
Find this compound or compounds like it in BindingDB:
Activity Spreadsheet -- Enzyme Inhibition Constant Data from BindingDB
Found 4 hits for monomerid = 50369801
TargetCorticotropin-releasing factor receptor 1(Homo sapiens (Human))
Dupont Pharmaceuticals
Curated by ChEMBL
LigandPNGBDBM50369801(CHEMBL1790241)
Affinity DataKi:  7.16nM. Assay description: Binding affinity of the receptor corticotropin releasing factor receptor with peptidic agonists
In DepthDetails ArticlePubMed
TargetCorticotropin-releasing factor receptor 2(Homo sapiens (Human))
Dupont Pharmaceuticals
Curated by ChEMBL
LigandPNGBDBM50369801(CHEMBL1790241)
Affinity DataKi:  86.4nM. Assay description: Binding affinity of the receptor h-CRF2-alpha with peptidic agonists
In DepthDetails ArticlePubMed
TargetCorticotropin-releasing factor receptor 2(Homo sapiens (Human))
Dupont Pharmaceuticals
Curated by ChEMBL
LigandPNGBDBM50369801(CHEMBL1790241)
Affinity DataEC50:  61.9nM. Assay description: Activity of peptidic agonists on h-CRF2-alpha receptor using agonist-stimulated adenylate cyclase assay
In DepthDetails ArticlePubMed
TargetCorticotropin-releasing factor receptor 1(Homo sapiens (Human))
Dupont Pharmaceuticals
Curated by ChEMBL
LigandPNGBDBM50369801(CHEMBL1790241)
Affinity DataEC50:  9.70nM. Assay description: Activity of peptidic agonists on corticotropin releasing factor receptor receptor using agonist-stimulated adenylate cyclase assay
In DepthDetails ArticlePubMed