BDBM50370125 CHEMBL4176817
SMILES CCCCCCCCCCCC(O)(OP(O)(O)=O)OP(O)(O)=O
InChI Key InChIKey=MQHUYGWQBFFUAD-UHFFFAOYSA-N
Data  1 IC50
  Tab Delimited (TSV)   2D SDfile   Computed 3D by Vconf -m prep SDfile
Find this compound or compounds like it in BindingDB:
Activity Spreadsheet -- Enzyme Inhibition Constant Data from BindingDB
Found 1 hit for monomerid = 50370125
TargetSphingomyelin phosphodiesterase(Homo sapiens)
China Pharmaceutical University
Curated by ChEMBL
LigandPNGBDBM50370125(CHEMBL4176817)
Affinity DataIC50:  70nM. Assay description: Inhibition of acid sphingomyelinase in human HuH7 cell lysate using NBD-sphingomyelin as substrate after 30 mins by TLC based fluorescence assay
In DepthDetails ArticlePubMed