BDBM50370328 CHEMBL1202892
SMILES CCC(CC)N1CCN(CC1)C(=O)CCOc1ccc(cc1)C#N
InChI Key InChIKey=KGIRGJIHPKWQMF-UHFFFAOYSA-N
Data  1 KI
  Tab Delimited (TSV)   2D SDfile   Computed 3D by Vconf -m prep SDfile
Find this compound or compounds like it in BindingDB:
Activity Spreadsheet -- Enzyme Inhibition Constant Data from BindingDB
Found 1 hit for monomerid = 50370328
TargetHistamine H3 receptor(Homo sapiens (Human))
Novo Nordisk
Curated by ChEMBL
LigandPNGBDBM50370328(CHEMBL1202892)
Affinity DataKi:  0.740nM. Assay description: Antagonist potency against human histamine H3 receptor expressed in CHO cells was determined by GTPgamma-S-assay
In DepthDetails ArticlePubMed