BDBM50370977 CHEMBL556799
SMILES N[C@@H](Cc1cnc[nH]1)C(=O)Cc1ccc(OCc2c(F)c(F)c(F)c(F)c2F)cc1
InChI Key InChIKey=YTLCCRNWLKXWBW-AWEZNQCLSA-N
Data  1 IC50
  Tab Delimited (TSV)   2D SDfile   Computed 3D by Vconf -m prep SDfile
Find this compound or compounds like it in BindingDB:
Activity Spreadsheet -- Enzyme Inhibition Constant Data from BindingDB
Found 1 hit for monomerid = 50370977
TargetHistidinol dehydrogenase(Brucella suis)
Ecole Nationale Sup£Rieure De Chimie De Montpellier
Curated by ChEMBL
LigandPNGBDBM50370977(CHEMBL556799)
Affinity DataIC50:  70nM. Assay description: Inhibition of Brucella suis histidinol dehydrogenase
In DepthDetails ArticlePubMed