BDBM50371153 CHEMBL242242
SMILES Cc1c(Cc2c(Cl)cccc2Cl)c(=O)ccn1Cc1ccc(cc1)-c1c[nH]c(CNC(=O)Nc2ncc(Br)s2)n1
InChI Key InChIKey=QDYWRECQRZXQFY-UHFFFAOYSA-N
Data  1 IC50
  Tab Delimited (TSV)   2D SDfile   Computed 3D by Vconf -m prep SDfile
Find this compound or compounds like it in BindingDB:
Activity Spreadsheet -- Enzyme Inhibition Constant Data from BindingDB
Found 1 hit for monomerid = 50371153
TargetTrans-2-enoyl-ACP reductase II(Streptococcus pneumoniae)
Meiji Seika Kaisha
Curated by ChEMBL
LigandPNGBDBM50371153(CHEMBL242242)
Affinity DataIC50:  1.10E+4nM. Assay description: Inhibition of Streptococcus pneumoniae FabK
In DepthDetails ArticlePubMed