BDBM50371223 CHEMBL246581
SMILES O=C(NCc1nc2ccccc2[nH]1)Nc1nc2cc(ccc2s1)C#N
InChI Key InChIKey=GLWBDQNDKZJSLI-UHFFFAOYSA-N
Data  1 IC50
  Tab Delimited (TSV)   2D SDfile   Computed 3D by Vconf -m prep SDfile
Find this compound or compounds like it in BindingDB:
Activity Spreadsheet -- Enzyme Inhibition Constant Data from BindingDB
Found 1 hit for monomerid = 50371223
TargetTrans-2-enoyl-ACP reductase II(Streptococcus pneumoniae)
Meiji Seika Kaisha
Curated by ChEMBL
LigandPNGBDBM50371223(CHEMBL246581)
Affinity DataIC50:  4.70E+3nM. Assay description: Inhibition of Streptococcus pneumoniae KU197 FabK
In DepthDetails ArticlePubMed