BDBM50371996 CHEMBL541993
SMILES C[C@@H]1NC(NCC(F)F)=Nc2cccc(Cl)c12
InChI Key InChIKey=JDPGHZDOBUGUDU-LURJTMIESA-N
Data  8 KI
  Tab Delimited (TSV)   2D SDfile   Computed 3D by Vconf -m prep SDfile
Find this compound or compounds like it in BindingDB:
Activity Spreadsheet -- Enzyme Inhibition Constant Data from BindingDB
Found 8 hits for monomerid = 50371996
Target5-hydroxytryptamine receptor 5A(RAT)
F. Hoffmann-La Roche
Curated by ChEMBL
LigandPNGBDBM50371996(CHEMBL541993)
Affinity DataKi:  2.90nM. Assay description: Binding affinity to rat 5HT5A receptor
In DepthDetails ArticlePubMed
Target5-hydroxytryptamine receptor 5A(Homo sapiens (Human))
F. Hoffmann-La Roche
Curated by ChEMBL
LigandPNGBDBM50371996(CHEMBL541993)
Affinity DataKi:  6.80nM. Assay description: Binding affinity to human 5HT5A receptor
In DepthDetails ArticlePubMed
Target5-hydroxytryptamine receptor 7(Homo sapiens (Human))
F. Hoffmann-La Roche
Curated by ChEMBL
LigandPNGBDBM50371996(CHEMBL541993)
Affinity DataKi:  24.8nM. Assay description: Binding affinity to human 5HT7 receptor
In DepthDetails ArticlePubMed
Target5-hydroxytryptamine receptor 1A(Homo sapiens (Human))
F. Hoffmann-La Roche
Curated by ChEMBL
LigandPNGBDBM50371996(CHEMBL541993)
Affinity DataKi:  56nM. Assay description: Binding affinity to human 5HT1A receptor
In DepthDetails ArticlePubMed
Target5-hydroxytryptamine receptor 2C(Homo sapiens (Human))
F. Hoffmann-La Roche
Curated by ChEMBL
LigandPNGBDBM50371996(CHEMBL541993)
Affinity DataKi:  352nM. Assay description: Binding affinity to human 5HT2C receptor
In DepthDetails ArticlePubMed
Target5-hydroxytryptamine receptor 2A(Homo sapiens (Human))
F. Hoffmann-La Roche
Curated by ChEMBL
LigandPNGBDBM50371996(CHEMBL541993)
Affinity DataKi:  491nM. Assay description: Binding affinity to human 5HT2A receptor
In DepthDetails ArticlePubMed
Target5-hydroxytryptamine receptor 1D(Homo sapiens (Human))
F. Hoffmann-La Roche
Curated by ChEMBL
LigandPNGBDBM50371996(CHEMBL541993)
Affinity DataKi:  1.44E+3nM. Assay description: Binding affinity to human 5HT1D receptor
In DepthDetails ArticlePubMed
Target5-hydroxytryptamine receptor 6(Homo sapiens (Human))
F. Hoffmann-La Roche
Curated by ChEMBL
LigandPNGBDBM50371996(CHEMBL541993)
Affinity DataKi:  4.48E+3nM. Assay description: Binding affinity to human 5HT6 receptor
In DepthDetails ArticlePubMed