BDBM50373716 CHEMBL403212
SMILES CCc1sc(CCO)c(C)[n+]1Cc1ccc(C)nc1N
InChI Key InChIKey=JFQTWWXPQOMYDT-UHFFFAOYSA-N
Data  1 Kd  1 EC50
  Tab Delimited (TSV)   2D SDfile   Computed 3D by Vconf -m prep SDfile
Find this compound or compounds like it in BindingDB:
Activity Spreadsheet -- Enzyme Inhibition Constant Data from BindingDB
Found 2 hits for monomerid = 50373716
TargetTransketolase(Homo sapiens (Human))
Array Biopharma
Curated by ChEMBL
LigandPNGBDBM50373716(CHEMBL403212)
Affinity DataEC50:  21nM. Assay description: Inhibition of human transketolase in HCT116 cells
In DepthDetails ArticlePubMed
TargetTransketolase(Homo sapiens (Human))
Array Biopharma
Curated by ChEMBL
LigandPNGBDBM50373716(CHEMBL403212)
Affinity DataKd:  75nM. Assay description: Inhibition of transketolase by TPPK/apo-TK coupled assay
In DepthDetails ArticlePubMed