BDBM50373721 CHEMBL270384
SMILES Cc1c(CCO)sc[n+]1Cc1cc(I)cnc1N
InChI Key InChIKey=RZRRPQWNCOERGA-UHFFFAOYSA-N
Data  1 Kd  1 EC50
  Tab Delimited (TSV)   2D SDfile   Computed 3D by Vconf -m prep SDfile
Find this compound or compounds like it in BindingDB:
Activity Spreadsheet -- Enzyme Inhibition Constant Data from BindingDB
Found 2 hits for monomerid = 50373721
TargetTransketolase(Homo sapiens (Human))
Array Biopharma
Curated by ChEMBL
LigandPNGBDBM50373721(CHEMBL270384)
Affinity DataEC50:  1.00E+3nM. Assay description: Inhibition of human transketolase in HCT116 cells
In DepthDetails ArticlePubMed
TargetTransketolase(Homo sapiens (Human))
Array Biopharma
Curated by ChEMBL
LigandPNGBDBM50373721(CHEMBL270384)
Affinity DataKd:  109nM. Assay description: Inhibition of transketolase by TPPK/apo-TK coupled assay
In DepthDetails ArticlePubMed