BDBM50373727 CHEMBL257929
SMILES Cc1c(CCO)sc[n+]1Cc1ccc(nc1)C(F)(F)F
InChI Key InChIKey=LVVFZTBWBOICDD-UHFFFAOYSA-N
Data  1 Kd  1 EC50
  Tab Delimited (TSV)   2D SDfile   Computed 3D by Vconf -m prep SDfile
Find this compound or compounds like it in BindingDB:
Activity Spreadsheet -- Enzyme Inhibition Constant Data from BindingDB
Found 2 hits for monomerid = 50373727
TargetTransketolase(Homo sapiens (Human))
Array Biopharma
Curated by ChEMBL
LigandPNGBDBM50373727(CHEMBL257929)
Affinity DataKd:  310nM. Assay description: Inhibition of transketolase by TPPK/apo-TK coupled assay
In DepthDetails ArticlePubMed
TargetTransketolase(Homo sapiens (Human))
Array Biopharma
Curated by ChEMBL
LigandPNGBDBM50373727(CHEMBL257929)
Affinity DataEC50:  470nM. Assay description: Inhibition of human transketolase in HCT116 cells
In DepthDetails ArticlePubMed