BDBM50373739 CHEMBL270168
SMILES Cc1c(CCO)sc[n+]1Cc1ccc(nc1N)C(F)(F)F
InChI Key InChIKey=ROHPYPVKNMKZMD-UHFFFAOYSA-N
Data  1 Kd  1 EC50
  Tab Delimited (TSV)   2D SDfile   Computed 3D by Vconf -m prep SDfile
Find this compound or compounds like it in BindingDB:
Activity Spreadsheet -- Enzyme Inhibition Constant Data from BindingDB
Found 2 hits for monomerid = 50373739
TargetTransketolase(Homo sapiens (Human))
Array Biopharma
Curated by ChEMBL
LigandPNGBDBM50373739(CHEMBL270168)
Affinity DataEC50:  160nM. Assay description: Inhibition of human transketolase in HCT116 cells
In DepthDetails ArticlePubMed
TargetTransketolase(Homo sapiens (Human))
Array Biopharma
Curated by ChEMBL
LigandPNGBDBM50373739(CHEMBL270168)
Affinity DataKd:  104nM. Assay description: Inhibition of transketolase by TPPK/apo-TK coupled assay
In DepthDetails ArticlePubMed