BDBM50373741 CHEMBL404300
SMILES Cc1c(CCCO)sc[n+]1Cc1ccc(C)nc1N
InChI Key InChIKey=ZQKZEMXLVSGVCS-UHFFFAOYSA-N
Data  1 EC50
  Tab Delimited (TSV)   2D SDfile   Computed 3D by Vconf -m prep SDfile
Find this compound or compounds like it in BindingDB:
Activity Spreadsheet -- Enzyme Inhibition Constant Data from BindingDB
Found 1 hit for monomerid = 50373741
TargetTransketolase(Homo sapiens (Human))
Array Biopharma
Curated by ChEMBL
LigandPNGBDBM50373741(CHEMBL404300)
Affinity DataEC50:  1.30E+3nM. Assay description: Inhibition of human transketolase in HCT116 cells
In DepthDetails ArticlePubMed