BDBM50373742 CHEMBL272095
SMILES Cc1c(CCC#N)sc[n+]1Cc1ccc(C)nc1N
InChI Key InChIKey=VRJYBHUTQYTCCL-UHFFFAOYSA-N
Data  1 EC50
  Tab Delimited (TSV)   2D SDfile   Computed 3D by Vconf -m prep SDfile
Find this compound or compounds like it in BindingDB:
Activity Spreadsheet -- Enzyme Inhibition Constant Data from BindingDB
Found 1 hit for monomerid = 50373742
TargetTransketolase(Homo sapiens (Human))
Array Biopharma
Curated by ChEMBL
LigandPNGBDBM50373742(CHEMBL272095)
Affinity DataEC50:  2.20E+3nM. Assay description: Inhibition of human transketolase in HCT116 cells
In DepthDetails ArticlePubMed