BDBM50373880 CHEMBL402764
SMILES Cc1c(CCO)sc(=O)n1Cc1ccc(C)nc1N
InChI Key InChIKey=RWODGYBNOPNGQQ-UHFFFAOYSA-N
Data  1 Kd  1 EC50
  Tab Delimited (TSV)   2D SDfile   Computed 3D by Vconf -m prep SDfile
Find this compound or compounds like it in BindingDB:
Activity Spreadsheet -- Enzyme Inhibition Constant Data from BindingDB
Found 2 hits for monomerid = 50373880
TargetTransketolase(Homo sapiens (Human))
Array Biopharma
Curated by ChEMBL
LigandPNGBDBM50373880(CHEMBL402764)
Affinity DataEC50:  3.24E+3nM. Assay description: Inhibition of transketolase in human HCT116 cells
In DepthDetails ArticlePubMed
TargetTransketolase(Homo sapiens (Human))
Array Biopharma
Curated by ChEMBL
LigandPNGBDBM50373880(CHEMBL402764)
Affinity DataKd: >5.00E+5nM. Assay description: Inhibition of apo-transketolase
In DepthDetails ArticlePubMed