BDBM50373882 CHEMBL255138
SMILES CC(=O)Nc1ncc(Cc2csc(CCO)c2C)c(N)n1
InChI Key InChIKey=ICBBIEGXLGPMJC-UHFFFAOYSA-N
Data  2 Kd  1 EC50
  Tab Delimited (TSV)   2D SDfile   Computed 3D by Vconf -m prep SDfile
Find this compound or compounds like it in BindingDB:
Activity Spreadsheet -- Enzyme Inhibition Constant Data from BindingDB
Found 3 hits for monomerid = 50373882
TargetTransketolase(Homo sapiens (Human))
Array Biopharma
Curated by ChEMBL
LigandPNGBDBM50373882(CHEMBL255138)
Affinity DataKd:  1.10E+3nM. Assay description: Inhibition of apo-transketolase
In DepthDetails ArticlePubMed
TargetTransketolase(Homo sapiens (Human))
Array Biopharma
Curated by ChEMBL
LigandPNGBDBM50373882(CHEMBL255138)
Affinity DataKd:  3nM. Assay description: Inhibition of apo-transketolase by coupled TPPK/Apo-TK enzymatic assay
In DepthDetails ArticlePubMed
TargetTransketolase(Homo sapiens (Human))
Array Biopharma
Curated by ChEMBL
LigandPNGBDBM50373882(CHEMBL255138)
Affinity DataEC50:  6.30E+3nM. Assay description: Inhibition of transketolase in human HCT116 cells
In DepthDetails ArticlePubMed