BDBM50376074 CHEMBL259356
SMILES NCC1CCN(CC1)c1ncnc2nc[nH]c12
InChI Key InChIKey=ZUPAKXAQBFFNRP-UHFFFAOYSA-N
Data  1 IC50
  Tab Delimited (TSV)   2D SDfile   Computed 3D by Vconf -m prep SDfile
Find this compound or compounds like it in BindingDB:
Activity Spreadsheet -- Enzyme Inhibition Constant Data from BindingDB
Found 1 hit for monomerid = 50376074
TargetRAC-beta serine/threonine-protein kinase(Homo sapiens (Human))
The Institute Of Cancer Research
Curated by ChEMBL
LigandPNGBDBM50376074(CHEMBL259356)
Affinity DataIC50:  290nM. Assay description: Inhibition of PKBbeta recombinant by radiometric filter binding assay
In DepthDetails ArticlePubMed