BDBM50376075 CHEMBL264667
SMILES NC(=O)C1CCN(CC1)c1ncnc2nc[nH]c12
InChI Key InChIKey=QPKOOAWJSYVLQU-UHFFFAOYSA-N
Data  1 IC50
  Tab Delimited (TSV)   2D SDfile   Computed 3D by Vconf -m prep SDfile
Find this compound or compounds like it in BindingDB:
Activity Spreadsheet -- Enzyme Inhibition Constant Data from BindingDB
Found 1 hit for monomerid = 50376075
TargetRAC-beta serine/threonine-protein kinase(Homo sapiens (Human))
The Institute Of Cancer Research
Curated by ChEMBL
LigandPNGBDBM50376075(CHEMBL264667)
Affinity DataIC50:  4.10E+4nM. Assay description: Inhibition of PKBbeta recombinant by radiometric filter binding assay
In DepthDetails ArticlePubMed