BDBM50378007 CHEMBL1627315
SMILES COc1ccc2[nH]c(cc2c1)C(=O)NCCC(O)CN1CCN(CC1)c1ccccc1OC
InChI Key InChIKey=SLERETJRSLMXIG-UHFFFAOYSA-N
Data  3 KI  1 IC50
  Tab Delimited (TSV)   2D SDfile   Computed 3D by Vconf -m prep SDfile
Find this compound or compounds like it in BindingDB:
Activity Spreadsheet -- Enzyme Inhibition Constant Data from BindingDB
Found 4 hits for monomerid = 50378007
TargetD(3) dopamine receptor(Homo sapiens (Human))
National Institute On Drug Abuse-Intramural Research Program
Curated by ChEMBL
LigandPNGBDBM50378007(CHEMBL1627315)
Affinity DataKi:  2.32nM. Assay description: Displacement of [125]IABN from human D3 receptor expressed in HEK293 cells
In DepthDetails ArticlePubMed
TargetD(4) dopamine receptor(Homo sapiens (Human))
National Institute On Drug Abuse-Intramural Research Program
Curated by ChEMBL
LigandPNGBDBM50378007(CHEMBL1627315)
Affinity DataKi:  1.53E+3nM. Assay description: Displacement of [125]IABN from human D4 receptor expressed in HEK293 cells
In DepthDetails ArticlePubMed
TargetD(1A) dopamine receptor(Homo sapiens (Human))
National Institute On Drug Abuse-Intramural Research Program
Curated by ChEMBL
LigandPNGBDBM50378007(CHEMBL1627315)
Affinity DataKi: >1.00E+4nM. Assay description: Displacement of [3H]SCH23390 from D1 receptor
In DepthDetails ArticlePubMed
TargetD(3) dopamine receptor(Homo sapiens (Human))
National Institute On Drug Abuse-Intramural Research Program
Curated by ChEMBL
LigandPNGBDBM50378007(CHEMBL1627315)
Affinity DataIC50:  1.58nM. Assay description: Antagonist activity at human D3 receptor expressed in HEK293 cells assessed as inhibition of quinpirole-stimulated mitogenesis
In DepthDetails ArticlePubMed