BDBM50379069 CHEMBL2011610
SMILES OC[C@@H]1NCC=C[C@@H]1O
InChI Key InChIKey=IIZFBLMFSCOJPJ-WDSKDSINSA-N
Data  2 IC50
  Tab Delimited (TSV)   2D SDfile   Computed 3D by Vconf -m prep SDfile
Find this compound or compounds like it in BindingDB:
Activity Spreadsheet -- Enzyme Inhibition Constant Data from BindingDB
Found 2 hits for monomerid = 50379069
TargetNon-lysosomal glucosylceramidase(Homo sapiens (Human))
TBA
Curated by ChEMBL
LigandPNGBDBM50379069(CHEMBL2011610)
Affinity DataIC50: >1.00E+6nM. Assay description: Inhibition of glucosylceramidase 2 from spleen of patient with gaucher's disease by fluorimetric analysis
In DepthDetails ArticlePubMed
TargetCeramide glucosyltransferase(Mus musculus)
TBA
Curated by ChEMBL
LigandPNGBDBM50379069(CHEMBL2011610)
Affinity DataIC50: >1.00E+4nM. Assay description: Inhibition of glucosylceramide synthase in mouse RAW cells preincubated for 15 mins followed by substrate addition and measured after 1 hr by fluores...
In DepthDetails ArticlePubMed