BDBM50380003 CHEMBL2012488
SMILES CC[C@@H]1[C@@H](C)C[C@@H]2[C@@H]([C@@H](C)OC2=O)[C@H]1\C=C\c1ccc(cn1)-c1cccc(c1)C(F)(F)F
InChI Key InChIKey=QAVYCZSGDXDSBS-CTEHMNNRSA-N
Data  1 IC50
  Tab Delimited (TSV)   2D SDfile   Computed 3D by Vconf -m prep SDfile
Find this compound or compounds like it in BindingDB:
Activity Spreadsheet -- Enzyme Inhibition Constant Data from BindingDB
Found 1 hit for monomerid = 50380003
TargetProteinase-activated receptor 1(Homo sapiens (Human))
Pfizer
Curated by ChEMBL
LigandPNGBDBM50380003(CHEMBL2012488)
Affinity DataIC50:  24nM. Assay description: Displacement of [3H]haTRAP from human PAR1 after 1 hr by TopCount scintillation counting
In DepthDetails ArticlePubMed