BDBM50380010 CHEMBL2012495
SMILES CC[C@@H]1[C@@H](C)C[C@@H]2[C@@H]([C@@H](C)OC2=O)[C@H]1\C=C\c1ccc(cn1)-c1cccc(C)c1
InChI Key InChIKey=LVDFAHKZJSYQQV-LPEXBXCHSA-N
Data  1 IC50
  Tab Delimited (TSV)   2D SDfile   Computed 3D by Vconf -m prep SDfile
Find this compound or compounds like it in BindingDB:
Activity Spreadsheet -- Enzyme Inhibition Constant Data from BindingDB
Found 1 hit for monomerid = 50380010
TargetProteinase-activated receptor 1(Homo sapiens (Human))
Pfizer
Curated by ChEMBL
LigandPNGBDBM50380010(CHEMBL2012495)
Affinity DataIC50:  45nM. Assay description: Displacement of [3H]haTRAP from human PAR1 after 1 hr by TopCount scintillation counting
In DepthDetails ArticlePubMed