BDBM50380357 CHEMBL2017820
SMILES COc1ccc(CCC(=O)N[C@@H](COP(O)(O)=O)C(=O)N2CCC[C@H]2C(=O)N[C@@H](C(C)C)C(=O)N[C@@H](Cc2ccccc2)C(O)=O)cc1OC
InChI Key InChIKey=JNNPOWRGJTZBMI-MGQBIDJDSA-N
Data  1 KI
  Tab Delimited (TSV)   2D SDfile   Computed 3D by Vconf -m prep SDfile
Find this compound or compounds like it in BindingDB:
Activity Spreadsheet -- Enzyme Inhibition Constant Data from BindingDB
Found 1 hit for monomerid = 50380357
TargetBreast cancer type 1 susceptibility protein(Homo sapiens (Human))
TBA
Curated by ChEMBL
LigandPNGBDBM50380357(CHEMBL2017820)
Affinity DataKi:  4.04E+3nM. Assay description: Inhibition of BRCT domain of His-tagged BRCA1 after 1 min by competitive fluorescence polarization assay
In DepthDetails ArticlePubMed