BDBM50380640 CHEMBL2017064
SMILES COc1cc2CCn3cnc(-c4cnc(CO)s4)c3-c2cc1OC
InChI Key InChIKey=ZTBPCVNOICVBPF-UHFFFAOYSA-N
Data  3 KI
  Tab Delimited (TSV)   2D SDfile   Computed 3D by Vconf -m prep SDfile
Find this compound or compounds like it in BindingDB:
Activity Spreadsheet -- Enzyme Inhibition Constant Data from BindingDB
Found 3 hits for monomerid = 50380640
TargetcAMP and cAMP-inhibited cGMP 3',5'-cyclic phosphodiesterase 10A(Homo sapiens (Human))
Merck Research Laboratories
Curated by ChEMBL
LigandPNGBDBM50380640(CHEMBL2017064)
Affinity DataKi:  26nM. Assay description: Inhibition of human recombinant PDE10A assessed as inhibition of [3H]cAMP hydrolysis by scintillation proximity assay
In DepthDetails ArticlePubMed
TargetcGMP-inhibited 3',5'-cyclic phosphodiesterase 3A(Homo sapiens (Human))
Merck Research Laboratories
Curated by ChEMBL
LigandPNGBDBM50380640(CHEMBL2017064)
Affinity DataKi:  540nM. Assay description: Inhibition of human recombinant PDE3A assessed as inhibition of [3H]cAMP hydrolysis by scintillation proximity assay
In DepthDetails ArticlePubMed
TargetHigh affinity cAMP-specific 3',5'-cyclic phosphodiesterase 7A(Homo sapiens (Human))
Merck Research Laboratories
Curated by ChEMBL
LigandPNGBDBM50380640(CHEMBL2017064)
Affinity DataKi:  4.60E+3nM. Assay description: Inhibition of human recombinant PDE7A1 assessed as inhibition of [3H]cAMP hydrolysis by scintillation proximity assay
In DepthDetails ArticlePubMed