BDBM50380655 CHEMBL2016583
SMILES COc1cc2CCn3cnc(c3-c2cc1OC)-c1cccc(Br)c1
InChI Key InChIKey=IBCQPBVZDUYUML-UHFFFAOYSA-N
Data  3 KI
  Tab Delimited (TSV)   2D SDfile   Computed 3D by Vconf -m prep SDfile
Find this compound or compounds like it in BindingDB:
Activity Spreadsheet -- Enzyme Inhibition Constant Data from BindingDB
Found 3 hits for monomerid = 50380655
TargetcAMP and cAMP-inhibited cGMP 3',5'-cyclic phosphodiesterase 10A(Homo sapiens (Human))
Merck Research Laboratories
Curated by ChEMBL
LigandPNGBDBM50380655(CHEMBL2016583)
Affinity DataKi:  32nM. Assay description: Inhibition of human recombinant PDE10A assessed as inhibition of [3H]cAMP hydrolysis by scintillation proximity assay
In DepthDetails ArticlePubMed
TargetcGMP-inhibited 3',5'-cyclic phosphodiesterase 3A(Homo sapiens (Human))
Merck Research Laboratories
Curated by ChEMBL
LigandPNGBDBM50380655(CHEMBL2016583)
Affinity DataKi:  1.28E+3nM. Assay description: Inhibition of human recombinant PDE3A assessed as inhibition of [3H]cAMP hydrolysis by scintillation proximity assay
In DepthDetails ArticlePubMed
TargetHigh affinity cAMP-specific 3',5'-cyclic phosphodiesterase 7A(Homo sapiens (Human))
Merck Research Laboratories
Curated by ChEMBL
LigandPNGBDBM50380655(CHEMBL2016583)
Affinity DataKi:  1.01E+4nM. Assay description: Inhibition of human recombinant PDE7A1 assessed as inhibition of [3H]cAMP hydrolysis by scintillation proximity assay
In DepthDetails ArticlePubMed