BDBM50381103 CHEMBL2017697
SMILES CC1(C)CC(=O)C2=C(C1)N(NC(=O)c1ccccc1)C1=C(C2c2ccc(OCc3ccccc3)cc2)C(=O)CC(C)(C)C1
InChI Key InChIKey=KBDHCIYVURUEFC-UHFFFAOYSA-N
Data  1 IC50
  Tab Delimited (TSV)   2D SDfile   Computed 3D by Vconf -m prep SDfile
Find this compound or compounds like it in BindingDB:
Activity Spreadsheet -- Enzyme Inhibition Constant Data from BindingDB
Found 1 hit for monomerid = 50381103
TargetNAD-dependent protein deacetylase sirtuin-1(Homo sapiens (Human))
Birla Institute Of Technology
Curated by ChEMBL
LigandPNGBDBM50381103(CHEMBL2017697)
Affinity DataIC50:  4.60E+4nM. Assay description: Inhibition of human SIRT1 using Fluor-de-Lys as substrate
In DepthDetails ArticlePubMed