BDBM50381104 CHEMBL2017706
SMILES COc1ccc(C(=O)NN2C3=C(C(C4=C2CC(C)(C)CC4=O)c2ccc(OCc4ccccc4)cc2)C(=O)CC(C)(C)C3)c(OC)n1
InChI Key InChIKey=NILCLLUUQOOAGI-UHFFFAOYSA-N
Data  1 IC50
  Tab Delimited (TSV)   2D SDfile   Computed 3D by Vconf -m prep SDfile
Find this compound or compounds like it in BindingDB:
Activity Spreadsheet -- Enzyme Inhibition Constant Data from BindingDB
Found 1 hit for monomerid = 50381104
TargetNAD-dependent protein deacetylase sirtuin-1(Homo sapiens (Human))
Birla Institute Of Technology
Curated by ChEMBL
LigandPNGBDBM50381104(CHEMBL2017706)
Affinity DataIC50:  2.50E+4nM. Assay description: Inhibition of human SIRT1 using Fluor-de-Lys as substrate
In DepthDetails ArticlePubMed