BDBM50384745 CHEMBL2037237
SMILES Clc1ccc(cc1)-n1sc(=O)n(Cc2ccccc2)c1=O
InChI Key InChIKey=ZZHUMSXDDHWBPE-UHFFFAOYSA-N
Data  2 IC50
  Tab Delimited (TSV)   2D SDfile   Computed 3D by Vconf -m prep SDfile
Find this compound or compounds like it in BindingDB:
Activity Spreadsheet -- Enzyme Inhibition Constant Data from BindingDB
Found 2 hits for monomerid = 50384745
TargetRegulator of G-protein signaling 4(Homo sapiens (Human))
TBA
Curated by ChEMBL
LigandPNGBDBM50384745(CHEMBL2037237)
Affinity DataIC50:  29nM. Assay description: Inhibition of RGS4 interaction with Galpha0 protein by flow cytometry protein interaction assay
In DepthDetails ArticlePubMed
TargetRegulator of G-protein signaling 8(Homo sapiens (Human))
TBA
Curated by ChEMBL
LigandPNGBDBM50384745(CHEMBL2037237)
Affinity DataIC50:  5.20E+3nM. Assay description: Inhibition of RGS8 interaction with Galpha0 protein by flow cytometry protein interaction assay
In DepthDetails ArticlePubMed