BDBM50386148 CHEMBL2042350
SMILES CC(C)[C@H](NC(=O)c1cc(no1)-c1ccc(NC(=O)Nc2cc(F)ccc2C)cc1)C(O)=O
InChI Key InChIKey=LMTRXDYVVURSFO-FQEVSTJZSA-N
Data  1 IC50
  Tab Delimited (TSV)   2D SDfile   Computed 3D by Vconf -m prep SDfile
Find this compound or compounds like it in BindingDB:
Activity Spreadsheet -- Enzyme Inhibition Constant Data from BindingDB
Found 1 hit for monomerid = 50386148
TargetChondroitin sulfate N-acetylgalactosaminyltransferase 1(Homo sapiens (Human))
Piramal Healthcare
Curated by ChEMBL
LigandPNGBDBM50386148(CHEMBL2042350)
Affinity DataIC50:  6.90E+4nM. Assay description: Inhibition of human DGAT1 assessed as conversion of [14C]-oleoyl-CoA to [14C]-triglyceride after 10 mins by scintillation counting
In DepthDetails ArticlePubMed