BDBM50386399 CHEMBL2049114
SMILES CCCC(=O)Nc1cccc(NC(=O)c2cc(F)ccc2Br)c1
InChI Key InChIKey=PSEPCRCESOAYGQ-UHFFFAOYSA-N
Data  1 IC50
  Tab Delimited (TSV)   2D SDfile   Computed 3D by Vconf -m prep SDfile
Find this compound or compounds like it in BindingDB:
Activity Spreadsheet -- Enzyme Inhibition Constant Data from BindingDB
Found 1 hit for monomerid = 50386399
TargetProteinase-activated receptor 1(Homo sapiens (Human))
TBA
Curated by ChEMBL
LigandPNGBDBM50386399(CHEMBL2049114)
Affinity DataIC50:  600nM. Assay description: Inhibition of SFLLRN-NH2-stimulated PAR1-mediated platelet activation in platelet-rich human plasma assessed as surface expression of P-selectin afte...
In DepthDetails ArticlePubMed