BDBM50386406 CHEMBL1718628
SMILES Brc1ccccc1C(=O)Nc1cccc(NC(=O)C2CCCC2)c1
InChI Key InChIKey=XQZSGWOACHZMLU-UHFFFAOYSA-N
Data  1 IC50
  Tab Delimited (TSV)   2D SDfile   Computed 3D by Vconf -m prep SDfile
Find this compound or compounds like it in BindingDB:
Activity Spreadsheet -- Enzyme Inhibition Constant Data from BindingDB
Found 1 hit for monomerid = 50386406
TargetProteinase-activated receptor 1(Homo sapiens (Human))
TBA
Curated by ChEMBL
LigandPNGBDBM50386406(CHEMBL1718628)
Affinity DataIC50:  520nM. Assay description: Inhibition of SFLLRN-NH2-stimulated PAR1-mediated platelet activation in platelet-rich human plasma assessed as surface expression of P-selectin afte...
In DepthDetails ArticlePubMed