BDBM50389108 CHEMBL2064632
SMILES CN(C)C[C@@H](OC(=O)N1Cc2c(NC(=O)C3(CC3)C(F)(F)F)[nH]nc2C1(C)C)c1ccccc1
InChI Key InChIKey=NORZHYUPBXCJOJ-MRXNPFEDSA-N
Data  1 EC50
  Tab Delimited (TSV)   2D SDfile   Computed 3D by Vconf -m prep SDfile
Find this compound or compounds like it in BindingDB:
Activity Spreadsheet -- Enzyme Inhibition Constant Data from BindingDB
Found 1 hit for monomerid = 50389108
TargetSerine/threonine-protein kinase PAK 4(Homo sapiens (Human))
Pfizer
Curated by ChEMBL
LigandPNGBDBM50389108(CHEMBL2064632)
Affinity DataEC50:  7nM. Assay description: Inhibition of PAK4-mediated GEF-H1 phosphorylation at Ser810 by cell based assay
In DepthDetails ArticlePubMed